x86_64-cygwin-gcc-4.9 v13_dev0-1602-g70ab277

Architecturex86
Variantx86_64
CPUgeneric
OScygwin
Ownerkostylev
Compilergcc 4.9.4 (GCC)
Configuration--enable-gpl --prefix=/home/mik/src/fate/x86_64-cygwin-gcc-4.9/install --samples=/home/mik/src/fate/fate-suite --arch=x86 --cross-prefix=x86_64-cygwin- --cc=x86_64-cygwin-gcc-4.9 --target-os=cygwin --host-cc=x86_64-cygwin-gcc-4.9 --disable-debug --enable-shared
Comment
Revisionv13_dev0-1602-g70ab277
Date2018-12-15 20:57:24
Statuserror compiling (2)
Warnings4
Logscompile configure
error compiling
                 from E:/msys32/home/mik/src/fate/src/libavdevice/alldevices.c:22:
e:\msys32\opt\x86_64-cygwin\x86_64-cygwin\include\sys\_stdint.h:20:9: error: unknown type name '__int8_t'
 typedef __int8_t int8_t ;
         ^
In file included from E:/msys32/home/mik/src/fate/src/libavdevice/avdevice.c:20:0:
./config.h:7:18: warning: missing terminating " character
 #define CC_IDENT "gcc 4.9.4
 (GCC)"
                  ^
./config.h:8:7: warning: missing terminating " character
 #define EXTERN_PREFIX ""
       ^
./config.h:8:2: error: missing terminating " character
 #define EXTERN_PREFIX ""
  ^
E:/msys32/home/mik/src/fate/src/libavdevice/avdevice.c:22:1: error: expected '=', ',', ';', 'asm' or '__attribute__' before 'unsigned'
 unsigned avdevice_version(void)
 ^
make: *** [/home/mik/src/fate/src/Makefile:49: libavdevice/avdevice.o] Error 1
make: *** Waiting for unfinished jobs....
make: *** [/home/mik/src/fate/src/Makefile:49: libavdevice/alldevices.o] Error 1