ppc-linux-clang v13_dev0-1248-g19388a7

Architectureppc
Variantppc
CPUgeneric
OSlinux
Ownerkostylev
Compilerclang version 6.0.0 (trunk 309610)
Configuration--prefix=/home/mik/src/fate/ppc-linux-clang/install --samples=/home/mik/src/fate/fate-suite --enable-gpl --cc='clang -m32' --disable-debug
Comment
Revisionv13_dev0-1248-g19388a7
Date2017-08-07 00:18:14
Statuserror compiling (2)
Warnings41
Logscompile configure
error compiling
<instantiation>:33:15: error: invalid memory operand
    lwz r1, 0(r1)
              ^
<instantiation>:19:5: note: while in macro instantiation
    fft_calc _interleave
    ^
/home/mik/src/fate/src/libavcodec/ppc/fft_altivec.S:452:1: note: while in macro instantiation
DECL_FFTS 1, _interleave
^
<instantiation>:34:17: error: invalid memory operand
    lwz r0, 2*4(r1)
                ^
<instantiation>:19:5: note: while in macro instantiation
    fft_calc _interleave
    ^
/home/mik/src/fate/src/libavcodec/ppc/fft_altivec.S:452:1: note: while in macro instantiation
DECL_FFTS 1, _interleave
^
make: *** [libavcodec/ppc/fft_altivec.o] Error 1
make: *** Waiting for unfinished jobs....